Reaction Details
TargetHistamine H4 receptor
LigandBDBM50240709
Substrate/Competitorn/a
Ki>10000±n/a nM
CommentsPDSP_3767
Citation Hancock, AABennani, YLBush, ENEsbenshade, TAFaghih, RFox, GBJacobson, PKnourek-Segel, VKrueger, KMNuss, MEPan, JBShapiro, RWitte, DGYao, BB Antiobesity effects of A-331440, a novel non-imidazole histamine H3 receptor antagonist. Eur J Pharmacol487:183-97 (2004) 
 
Histamine H4 receptor
Name:Histamine H4 receptor
Type:G Protein-Coupled Receptor (GPCR)
Mol. Mass.:44517.02
Organism:Homo sapiens (Human)
Description:Binding assays were using CHO cells stably expressing hH4R receptors.
Residue:390
BDBM50240709
NameBDBM50240709
Synonyms:(R)-4'-(3-(3-(dimethylamino)pyrrolidin-1-yl)propoxy)biphenyl-4-carbonitrile A-331440 | CHEMBL319000
TypeSmall organic molecule
Emp. Form.C22H27N3O
Mol. Mass.349.4693
SMILESCN(C)[C@@H]1CCN(CCCOc2ccc(cc2)-c2ccc(cc2)C#N)C1