Reaction Details
Target3-phosphoinositide-dependent protein kinase 1
LigandBDBM92402
Substrate/Competitorn/a
Meas. Tech.Proliferation Assay
EC50 9±0.0 nM
Citation Nagashima, KShumway, SDSathyanarayanan, SChen, AHDolinski, BXu, YKeilhack, HNguyen, TWiznerowicz, MLi, LLutterbach, BAChi, APaweletz, CAllison, TYan, YMunshi, SKKlippel, AKraus, MBobkova, EVDeshmukh, SXu, ZMueller, USzewczak, AAPan, BSRichon, VPollock, RBlume-Jensen, PNorthrup, AAndersen, JN Genetic and pharmacological inhibition of PDK1 in cancer cells: characterization of a selective allosteric kinase inhibitor. J Biol Chem286:6433-48 (2011) 
 
3-phosphoinositide-dependent protein kinase 1
Name:3-phosphoinositide-dependent protein kinase 1
Type:Enzyme
Mol. Mass.:63157.65
Organism:Homo sapiens (Human)
Description:O15530
Residue:556
BDBM92402
NameBDBM92402
Synonyms:PDK1 inhibitor, 2
TypeSmall organic molecule
Emp. Form.C26H27N5O
Mol. Mass.425.5255
SMILESCC(Nc1nc2c(c[nH]c(=O)c2c2cc(ccc12)-c1cn[nH]c1)C#CC1CC1)C(C)(C)C