Reaction Details
Target3-phosphoinositide-dependent protein kinase 1
LigandBDBM17051
Substrate/Competitorn/a
Meas. Tech.Proliferation Assay
EC50 26±0.0 nM
Citation Nagashima, KShumway, SDSathyanarayanan, SChen, AHDolinski, BXu, YKeilhack, HNguyen, TWiznerowicz, MLi, LLutterbach, BAChi, APaweletz, CAllison, TYan, YMunshi, SKKlippel, AKraus, MBobkova, EVDeshmukh, SXu, ZMueller, USzewczak, AAPan, BSRichon, VPollock, RBlume-Jensen, PNorthrup, AAndersen, JN Genetic and pharmacological inhibition of PDK1 in cancer cells: characterization of a selective allosteric kinase inhibitor. J Biol Chem286:6433-48 (2011) 
 
3-phosphoinositide-dependent protein kinase 1
Name:3-phosphoinositide-dependent protein kinase 1
Type:Enzyme
Mol. Mass.:63157.65
Organism:Homo sapiens (Human)
Description:O15530
Residue:556
BDBM17051
NameBDBM17051
Synonyms:BX-795 N-(3-{[5-iodo-4-({3-[(thiophen-2-ylcarbonyl)amino]propyl}amino)pyrimidin-2-yl]amino}phenyl)pyrrolidine-1-carboxamide | N-{3-[(5-iodo-4-{[3-(thiophen-2-ylformamido)propyl]amino}pyrimidin-2-yl)amino]phenyl}pyrrolidine-1-carboxamide
TypeSmall organic molecule
Emp. Form.C23H26IN7O2S
Mol. Mass.591.468
SMILESIc1cnc(Nc2cccc(NC(=O)N3CCCC3)c2)nc1NCCCNC(=O)c1cccs1