Reaction Details
TargetAurora kinase B
LigandBDBM92870
Substrate/Competitorn/a
Meas. Tech.Aurora Kinase Assay
IC50 145±0.0 nM
Citation Zheng, MZheng, YXue, YLiu, YAn, LZhang, LJi, MXue, BWu, XGong, XGu, NZhan, X Synthesis and Quantum Chemical Studies of New 4-aminoquinazoline Derivatives as Aurora A/B Kinase Inhibitors. Chem Biol Drug Des81:399-407 (2013) 
 
Aurora kinase B
Name:Aurora kinase B
Type:Protein
Mol. Mass.:39327.72
Organism:Homo sapiens (Human)
Description:Q96GD4
Residue:344
BDBM92870
NameBDBM92870
Synonyms:4-Aminoquinazoline derivative, 6d
TypeSmall molecule
Emp. Form.C31H32N8O
Mol. Mass.532.6388
SMILESCc1ccc(Nc2ncnc3cc(OCCCN4CCCC4)ccc23)cc1Nc1ncc(cn1)-c1cccnc1