Reaction Details
TargetAurora kinase B
LigandBDBM92871
Substrate/Competitorn/a
Meas. Tech.Aurora Kinase Assay
IC50 136±0.0 nM
Citation Zheng, MZheng, YXue, YLiu, YAn, LZhang, LJi, MXue, BWu, XGong, XGu, NZhan, X Synthesis and Quantum Chemical Studies of New 4-aminoquinazoline Derivatives as Aurora A/B Kinase Inhibitors. Chem Biol Drug Des81:399-407 (2013) 
 
Aurora kinase B
Name:Aurora kinase B
Type:Protein
Mol. Mass.:39327.72
Organism:Homo sapiens (Human)
Description:Q96GD4
Residue:344
BDBM92871
NameBDBM92871
Synonyms:4-Aminoquinazoline derivative, 6f
TypeSmall molecule
Emp. Form.C27H31N5O3S
Mol. Mass.505.632
SMILESCCOC(=O)c1csc2cc(Nc3ncnc4cc(OCCCN5CCN(C)CC5)ccc34)ccc12