Reaction Details
Target3-oxoacyl-[acyl-carrier-protein] synthase 1
LigandBDBM93058
Substrate/Competitorn/a
Meas. Tech.Binding Fluorescence Titrations
pH8.5±0
Kd 6.82e+4± 1.0e+3 nM
Citation Kapilashrami, KBommineni, GRMachutta, CAKim, PLai, CTSimmerling, CPicart, FTonge, PJ Thiolactomycin-based ß-Ketoacyl-AcpM Synthase A (KasA) Inhibitors: FRAGMENT-BASED INHIBITOR DISCOVERY USING TRANSIENT ONE-DIMENSIONAL NUCLEAR OVERHAUSER EFFECT NMR SPECTROSCOPY. J Biol Chem288:6045-52 (2013) 
 
3-oxoacyl-[acyl-carrier-protein] synthase 1
Name:3-oxoacyl-[acyl-carrier-protein] synthase 1
Type:Protein
Mol. Mass.:43305.57
Organism:Mycobacterium tuberculosis
Description:P9WQD9
Residue:416
BDBM93058
NameBDBM93058
Synonyms:TLM analog, 15
TypeSmall molecule
Emp. Form.C20H23ClO2S
Mol. Mass.362.913
SMILESC\C(C=C)=C/[C@@]1(C)SC(=O)C(CCCCc2ccc(Cl)cc2)C1=O