Reaction Details
Target3-oxoacyl-[acyl-carrier-protein] synthase 1
LigandBDBM93060
Substrate/Competitorn/a
Meas. Tech.Binding Fluorescence Titrations
pH8.5±0
Kd 2.50e+4± 4.0e+3 nM
Citation Kapilashrami, KBommineni, GRMachutta, CAKim, PLai, CTSimmerling, CPicart, FTonge, PJ Thiolactomycin-based ß-Ketoacyl-AcpM Synthase A (KasA) Inhibitors: FRAGMENT-BASED INHIBITOR DISCOVERY USING TRANSIENT ONE-DIMENSIONAL NUCLEAR OVERHAUSER EFFECT NMR SPECTROSCOPY. J Biol Chem288:6045-52 (2013) 
 
3-oxoacyl-[acyl-carrier-protein] synthase 1
Name:3-oxoacyl-[acyl-carrier-protein] synthase 1
Type:Protein
Mol. Mass.:43305.57
Organism:Mycobacterium tuberculosis
Description:P9WQD9
Residue:416
BDBM93060
NameBDBM93060
Synonyms:TLM analog, 17
TypeSmall molecule
Emp. Form.C30H32FN5O5S2
Mol. Mass.625.734
SMILESC\C(C=C)=C/[C@@]1(C)SC(=O)C(CCCCn2cc(CNC(=O)c3ccc(NS(=O)(=O)c4ccc(F)cc4)cc3)nn2)C1=O