Reaction Details
Target3-oxoacyl-[acyl-carrier-protein] synthase 1
LigandBDBM50241313
Substrate/Competitorn/a
Meas. Tech.Binding Fluorescence Titrations
pH8.5±0
Ki 1.9e+3± 3e+2 nM
Citation Kapilashrami, KBommineni, GRMachutta, CAKim, PLai, CTSimmerling, CPicart, FTonge, PJ Thiolactomycin-based ß-Ketoacyl-AcpM Synthase A (KasA) Inhibitors: FRAGMENT-BASED INHIBITOR DISCOVERY USING TRANSIENT ONE-DIMENSIONAL NUCLEAR OVERHAUSER EFFECT NMR SPECTROSCOPY. J Biol Chem288:6045-52 (2013) 
 
3-oxoacyl-[acyl-carrier-protein] synthase 1
Name:3-oxoacyl-[acyl-carrier-protein] synthase 1
Type:Protein
Mol. Mass.:43305.57
Organism:Mycobacterium tuberculosis
Description:P9WQD8
Residue:416
BDBM50241313
NameBDBM50241313
Synonyms:(5R)-4-hydroxy-3,5-dimethyl-5-[(1E)-2-methylbuta-1,3-dienyl]thiophen-2(5H)-one (R)-4-Hydroxy-3,5-dimethyl-5-((E)-2-methyl-buta-1,3-dienyl)-5H-thiophen-2-one 5R-Thiolactomycin TLM analog, 1
TypeSmall organic molecule
Emp. Form.C11H14O2S
Mol. Mass.210.293
SMILESCC1C(=O)S[C@](C)(\C=C(/C)C=C)C1=O