Reaction Details
Target3-oxoacyl-[acyl-carrier-protein] synthase 1
LigandBDBM93046
Substrate/Competitorn/a
Meas. Tech.Binding Fluorescence Titrations
pH8.5±0
Ki 7.1e+3± 1.3e+3 nM
Citation Kapilashrami, KBommineni, GRMachutta, CAKim, PLai, CTSimmerling, CPicart, FTonge, PJ Thiolactomycin-based ß-Ketoacyl-AcpM Synthase A (KasA) Inhibitors: FRAGMENT-BASED INHIBITOR DISCOVERY USING TRANSIENT ONE-DIMENSIONAL NUCLEAR OVERHAUSER EFFECT NMR SPECTROSCOPY. J Biol Chem288:6045-52 (2013) 
 
3-oxoacyl-[acyl-carrier-protein] synthase 1
Name:3-oxoacyl-[acyl-carrier-protein] synthase 1
Type:Protein
Mol. Mass.:43305.57
Organism:Mycobacterium tuberculosis
Description:P9WQD8
Residue:416
BDBM93046
NameBDBM93046
Synonyms:TLM analog, 3
TypeSmall molecule
Emp. Form.C12H16O2S
Mol. Mass.224.319
SMILESCCC1C(=O)S[C@](C)(\C=C(/C)C=C)C1=O