Reaction Details
TargetAnthranilate phosphoribosyltransferase
LigandBDBM93074
Substrate/Competitorn/a
Meas. Tech.Fluoresence-based Assay
Ki 6.3e+3± 8e+2 nM
Citation Castell, AShort, FLEvans, GLCookson, TVBulloch, EMJoseph, DDLee, CEParker, EJBaker, ENLott, JS The Substrate Capture Mechanism of Mycobacterium tuberculosis Anthranilate Phosphoribosyltransferase Provides a Mode for Inhibition. Biochemistry52:1776-1787 (2013) 
 
Anthranilate phosphoribosyltransferase
Name:Anthranilate phosphoribosyltransferase
Type:Enzyme
Mol. Mass.:37738.87
Organism:Mycobacterium tuberculosis
Description:P9WFX4
Residue:370
BDBM93074
NameBDBM93074
Synonyms:ACS No 142
TypeSmall molecule
Emp. Form.C9H10NO2
Mol. Mass.164.1817
SMILESCc1cc(C)c(N)c(c1)C([O-])=O