Reaction Details
TargetAnthranilate phosphoribosyltransferase
LigandBDBM85513
Substrate/Competitorn/a
Meas. Tech.Fluoresence-based Assay
Ki 1.19e+5± 2.0e+4 nM
Citation Castell, AShort, FLEvans, GLCookson, TVBulloch, EMJoseph, DDLee, CEParker, EJBaker, ENLott, JS The Substrate Capture Mechanism of Mycobacterium tuberculosis Anthranilate Phosphoribosyltransferase Provides a Mode for Inhibition. Biochemistry52:1776-1787 (2013) 
 
Anthranilate phosphoribosyltransferase
Name:Anthranilate phosphoribosyltransferase
Type:Enzyme
Mol. Mass.:37738.87
Organism:Mycobacterium tuberculosis
Description:P9WFX4
Residue:370
BDBM85513
NameBDBM85513
Synonyms:ACS No 10 NSC_5900 sal
TypeSmall organic molecule
Emp. Form.C7H5O3
Mol. Mass.137.1133
SMILESOc1ccccc1C([O-])=O