Reaction Details
TargetActivin receptor type-1B
LigandBDBM280347
Substrate/Competitorn/a
Meas. Tech.In Vitro Kinase Assay Inhibition of ALK1/2/3/4/5/6 Kinases
IC50 45.1±n/a nM
Citation Rai, RChakravarty, SPujala, BShinde, BUNayak, AKChaklan, NAgarwal, AKRamachandran, SAPham, SM Compounds and methods of use US Patent US10030004 Publication Date 7/24/2018
 
Activin receptor type-1B
Name:Activin receptor type-1B
Type:PROTEIN
Mol. Mass.:56810.99
Organism:Homo sapiens (Human)
Description:ChEMBL_587064
Residue:505
BDBM280347
NameBDBM280347
Synonyms:N-(2-acetamidoethyl)-4-[[2-(5-chloro-2-fluoro-phenyl)-5-isopropyl-4-pyridyl]amino]pyridine-3-carboxamide US10501436, Compound 14 US11702401, Compound 14
TypeSmall organic molecule
Emp. Form.C24H25ClFN5O2
Mol. Mass.469.939
SMILESCC(C)c1cnc(cc1Nc1ccncc1C(=O)NCCNC(C)=O)-c1cc(Cl)ccc1F