Reaction Details
TargetTGF-beta receptor type-1
LigandBDBM280356
Substrate/Competitorn/a
Meas. Tech.In Vitro Kinase Assay Inhibition of ALK1/2/3/4/5/6 Kinases
IC50 16.9±n/a nM
Citation Rai, RChakravarty, SPujala, BShinde, BUNayak, AKChaklan, NAgarwal, AKRamachandran, SAPham, SM Compounds and methods of use US Patent US10030004 Publication Date 7/24/2018
 
TGF-beta receptor type-1
Name:TGF-beta receptor type-1
Type:enzyme
Mol. Mass.:55968.24
Organism:Homo sapiens (Human)
Description:P36897
Residue:503
BDBM280356
NameBDBM280356
Synonyms:4-[[2-amino-6-(5-chloro-2-fluoro-phenyl)-3-isopropenyl-4-pyridyl]amino]-N-[(2S)-2-hydroxypropyl]pyridine-3-carboxamide US11053216, Compound 23a | US11702401, Compound 23a
TypeSmall organic molecule
Emp. Form.C26H26ClFN4O4
Mol. Mass.512.96
SMILESCOC(=O)c1cnccc1Nc1cc(nc(NC(=O)OC(C)(C)C)c1C(C)=C)-c1cc(Cl)ccc1F