Reaction Details
TargetTGF-beta receptor type-1
LigandBDBM280369
Substrate/Competitorn/a
Meas. Tech.In Vitro Kinase Assay Inhibition of ALK1/2/3/4/5/6 Kinases
IC50 8.20±n/a nM
Citation Rai, RChakravarty, SPujala, BShinde, BUNayak, AKChaklan, NAgarwal, AKRamachandran, SAPham, SM Compounds and methods of use US Patent US10030004 Publication Date 7/24/2018
 
TGF-beta receptor type-1
Name:TGF-beta receptor type-1
Type:enzyme
Mol. Mass.:55968.24
Organism:Homo sapiens (Human)
Description:P36897
Residue:503
BDBM280369
NameBDBM280369
Synonyms:2-(5-chloro-2-fluorophenyl)-5-(propan-2-yl)-N-{7H-pyrrolo[2,3-d]pyrimidin-4-yl}pyridin-4-amine US10501436, Compound 35 US11702401, Compound 35
TypeSmall organic molecule
Emp. Form.C20H17ClFN5
Mol. Mass.381.834
SMILESCC(C)c1cnc(cc1Nc1ncnc2[nH]ccc12)-c1cc(Cl)ccc1F