Reaction Details
TargetMitogen-activated protein kinase 8
LigandBDBM100438
Substrate/Competitorn/a
Meas. Tech.In Vitro Enzyme Assay
IC50 7±n/a nM
Citation Bilotta, JACheung, AWFirooznia, FGuertin, KRHayden, SHaynes, NLukacs-Lesburg, CMMarcopulos, NMertz, EQi, LQian, YSo, STan, JThakkar, KC Aminomethyl quinolone compounds US Patent US8501732 Publication Date 8/6/2013
 
Mitogen-activated protein kinase 8
Name:Mitogen-activated protein kinase 8
Type:Enzyme
Mol. Mass.:48297.57
Organism:Homo sapiens (Human)
Description:JNK-1 was purchased from Upstate Cell Signaling Solutions (formerly Upstate Biotechnology).
Residue:427
BDBM100438
NameBDBM100438
Synonyms:US8501732, I-2
TypeSmall organic molecule
Emp. Form.C29H24ClN5O4
Mol. Mass.541.985
SMILESClc1ccc2c(c1)n(-c1ccccc1)c(-c1ncco1)c(CNC(=O)c1ccnc(c1)N1CCOCC1)c2=O