Reaction Details
TargetLysosomal acid glucosylceramidase
LigandBDBM108224
Substrate/Competitorn/a
Meas. Tech.GCase Ki Assay
pH5.2±0
Ki 4.18±0.0 nM
Citation Li, ZLi, TDai, SXie, XMa, XZhao, WZhang, WLi, JWang, PG New insights into the pharmacological chaperone activity of c2-substituted glucoimidazoles for the treatment of Gaucher disease. Chembiochem14:1239-47 (2013) 
 
Lysosomal acid glucosylceramidase
Name:Lysosomal acid glucosylceramidase
Type:Enzyme
Mol. Mass.:59724.64
Organism:Homo sapiens (Human)
Description:The beta-Glu activity was measured with commercially available beta-glucocerebrosidase (Ceredase) as the enzyme source.
Residue:536
BDBM108224
NameBDBM108224
Synonyms:N-phenyl-4-[6,7,8-trihydroxy-5-(hydroxymethyl)- 5H,6H,7H,8H-imidazo[1,2-a]pyridin-2-yl]butanamide (Compound 10)
TypeSmall organic molecule
Emp. Form.C18H23N3O5
Mol. Mass.361.3923
SMILESOCC1C(O)C(O)C(O)c2nc(CCCC(=O)Nc3ccccc3)cn12