Reaction Details
TargetLysosomal acid glucosylceramidase
LigandBDBM108225
Substrate/Competitorn/a
Meas. Tech.GCase Ki Assay
pH5.2±0
Ki 18.9±0.0 nM
Citation Li, ZLi, TDai, SXie, XMa, XZhao, WZhang, WLi, JWang, PG New insights into the pharmacological chaperone activity of c2-substituted glucoimidazoles for the treatment of Gaucher disease. Chembiochem14:1239-47 (2013) 
 
Lysosomal acid glucosylceramidase
Name:Lysosomal acid glucosylceramidase
Type:Enzyme
Mol. Mass.:59724.64
Organism:Homo sapiens (Human)
Description:The beta-Glu activity was measured with commercially available beta-glucocerebrosidase (Ceredase) as the enzyme source.
Residue:536
BDBM108225
NameBDBM108225
Synonyms:2,2-dimethyl-N-phenyl-5-[6,7,8-trihydroxy-5- (hydroxymethyl)-5H,6H,7H,8H-imidazo[1,2-a]pyridin-2- yl]pentanamide (Compound 11)
TypeSmall organic molecule
Emp. Form.C21H29N3O5
Mol. Mass.403.4721
SMILESCC(C)(CCCc1cn2C(CO)C(O)C(O)C(O)c2n1)C(=O)Nc1ccccc1