Reaction Details
TargetLysosomal acid glucosylceramidase
LigandBDBM50156357
Substrate/Competitorn/a
Meas. Tech.GCase Ki Assay
pH5.2±0
Ki 488±0.0 nM
Citation Li, ZLi, TDai, SXie, XMa, XZhao, WZhang, WLi, JWang, PG New insights into the pharmacological chaperone activity of c2-substituted glucoimidazoles for the treatment of Gaucher disease. Chembiochem14:1239-47 (2013) 
 
Lysosomal acid glucosylceramidase
Name:Lysosomal acid glucosylceramidase
Type:Enzyme
Mol. Mass.:59724.64
Organism:Homo sapiens (Human)
Description:The beta-Glu activity was measured with commercially available beta-glucocerebrosidase (Ceredase) as the enzyme source.
Residue:536
BDBM50156357
NameBDBM50156357
Synonyms:2-Hydroxymethyl-1-nonyl-piperidine-3,4,5-triol NN-DNJ
TypeSmall organic molecule
Emp. Form.C15H31NO4
Mol. Mass.289.4109
SMILESCCCCCCCCCN1CC(O)C(O)C(O)C1CO