Reaction Details
TargetPrunasin hydrolase
LigandBDBM50156357
Substrate/Competitorn/a
Meas. Tech.Inhibition Assay Against Commercial Glycosidases
pH10.6±n/a
Temperature310.15±n/a K
IC50 9.59e+4±n/a nM
Commentsextracted
Citation Li, ZLi, TDai, SXie, XMa, XZhao, WZhang, WLi, JWang, PG New insights into the pharmacological chaperone activity of c2-substituted glucoimidazoles for the treatment of Gaucher disease. Chembiochem14:1239-47 (2013) 
 
Prunasin hydrolase
Name:Prunasin hydrolase
Type:Protein
Mol. Mass.:61905.54
Organism:Prunus dulcis (Almond)
Description:n/a
Residue:544
BDBM50156357
NameBDBM50156357
Synonyms:2-Hydroxymethyl-1-nonyl-piperidine-3,4,5-triol NN-DNJ
TypeSmall organic molecule
Emp. Form.C15H31NO4
Mol. Mass.289.4109
SMILESCCCCCCCCCN1CC(O)C(O)C(O)C1CO