Reaction Details
TargetBeta-galactosidase
LigandBDBM108217
Substrate/Competitorn/a
Meas. Tech.Inhibition Assay Against Commercial Glycosidases
pH10.6±n/a
Temperature310.15±n/a K
IC50 3.5e+2±n/a nM
Commentsextracted
Citation Li, ZLi, TDai, SXie, XMa, XZhao, WZhang, WLi, JWang, PG New insights into the pharmacological chaperone activity of c2-substituted glucoimidazoles for the treatment of Gaucher disease. Chembiochem14:1239-47 (2013) 
 
Beta-galactosidase
Name:Beta-galactosidase
Type:Protein
Mol. Mass.:73420.88
Organism:Bos taurus (Bovine)
Description:n/a
Residue:653
BDBM108217
NameBDBM108217
Synonyms:2-(3,3-dimethylbutyl)-5-(hydroxymethyl)- 5H,6H,7H,8H-imidazo[1,2-a]pyridine-6,7,8-triol (Compound 3)
TypeSmall organic molecule
Emp. Form.C14H24N2O4
Mol. Mass.284.3514
SMILESCC(C)(C)CCc1cn2C(CO)C(O)C(O)C(O)c2n1