Reaction Details
TargetBeta-galactosidase
LigandBDBM108218
Substrate/Competitorn/a
Meas. Tech.Inhibition Assay Against Commercial Glycosidases
pH10.6±n/a
Temperature310.15±n/a K
IC50 37±n/a nM
Commentsextracted
Citation Li, ZLi, TDai, SXie, XMa, XZhao, WZhang, WLi, JWang, PG New insights into the pharmacological chaperone activity of c2-substituted glucoimidazoles for the treatment of Gaucher disease. Chembiochem14:1239-47 (2013) 
 
Beta-galactosidase
Name:Beta-galactosidase
Type:Protein
Mol. Mass.:73420.88
Organism:Bos taurus (Bovine)
Description:n/a
Residue:653
BDBM108218
NameBDBM108218
Synonyms:5-(hydroxymethyl)-2-octyl-5H,6H,7H,8H-imidazo[1,2- a]pyridine-6,7,8-triol (Compound 4)
TypeSmall organic molecule
Emp. Form.C16H28N2O4
Mol. Mass.312.4045
SMILESCCCCCCCCc1cn2C(CO)C(O)C(O)C(O)c2n1