Reaction Details
TargetBeta-galactosidase
LigandBDBM108220
Substrate/Competitorn/a
Meas. Tech.Inhibition Assay Against Commercial Glycosidases
pH10.6±n/a
Temperature310.15±n/a K
IC50 92±n/a nM
Commentsextracted
Citation Li, ZLi, TDai, SXie, XMa, XZhao, WZhang, WLi, JWang, PG New insights into the pharmacological chaperone activity of c2-substituted glucoimidazoles for the treatment of Gaucher disease. Chembiochem14:1239-47 (2013) 
 
Beta-galactosidase
Name:Beta-galactosidase
Type:Protein
Mol. Mass.:73420.88
Organism:Bos taurus (Bovine)
Description:n/a
Residue:653
BDBM108220
NameBDBM108220
Synonyms:5-(hydroxymethyl)-2-[3-(4-methoxyphenyl)propyl]- 5H,6H,7H,8H-imidazo[1,2-a]pyridine-6,7,8-triol (Compound 6)
TypeSmall organic molecule
Emp. Form.C18H24N2O5
Mol. Mass.348.3936
SMILESCOc1ccc(CCCc2cn3C(CO)C(O)C(O)C(O)c3n2)cc1