Reaction Details
TargetAlpha-galactosidase
LigandBDBM108222
Substrate/Competitorn/a
Meas. Tech.Inhibition Assay Against Commercial Glycosidases
pH10.6±n/a
Temperature310.15±n/a K
IC50 1.14e+4±n/a nM
Commentsextracted
Citation Li, ZLi, TDai, SXie, XMa, XZhao, WZhang, WLi, JWang, PG New insights into the pharmacological chaperone activity of c2-substituted glucoimidazoles for the treatment of Gaucher disease. Chembiochem14:1239-47 (2013) 
 
Alpha-galactosidase
Name:Alpha-galactosidase
Type:Protein
Mol. Mass.:41306.82
Organism:Coffea arabica (Coffee beans)
Description:n/a
Residue:378
BDBM108222
NameBDBM108222
Synonyms:2-[3-(4-cyclohexylphenyl)propyl]-5-(hydroxymethyl)- 5H,6H,7H,8H-imidazo[1,2-a]pyridine-6,7,8-triol (Compound 8)
TypeSmall organic molecule
Emp. Form.C23H32N2O4
Mol. Mass.400.5112
SMILESOCC1C(O)C(O)C(O)c2nc(CCCc3ccc(cc3)C3CCCCC3)cn12