Reaction Details
TargetSGLT1 protein
LigandBDBM109278
Substrate/Competitorn/a
Meas. Tech.Inhibition Assay
IC50 2520±0.0 nM
Citation Yang, FTang, PCDong, QTu, WFan, JGuan, DShen, GWang, YYuan, JZhang, L C-aryl glucoside derivatives, preparation process and pharmaceutical use thereof US Patent US8609622 Publication Date 12/17/2013
 
SGLT1 protein
Name:SGLT1 protein
Type:Protein
Mol. Mass.:73320.01
Organism:Mus musculus (Mouse)
Description:Q9QXI6
Residue:665
BDBM109278
NameBDBM109278
Synonyms:US8609622, 5
TypeSmall organic molecule
Emp. Form.C22H23ClO7
Mol. Mass.434.867
SMILESOC[C@]12COC(O1)([C@H](O)[C@@H](O)[C@@H]2O)c1ccc(Cl)c(Cc2ccc3OCCc3c2)c1