Reaction Details
TargetTyrosine-protein kinase CSK
LigandBDBM110199
Substrate/Competitorn/a
Meas. Tech.c-Src Kinase Inhibitory Activity Assay
pH7.5±n/a
Temperature298.15±n/a K
IC50 2.18e+4±n/a nM
Commentsextracted
Citation Chand, KPrasad, STiwari, RKShirazi, ANKumar, SParang, KSharma, SK Synthesis and evaluation of c-Src kinase inhibitory activity of pyridin-2(1H)-one derivatives. Bioorg Chem53:75-82 (2014) 
 
Tyrosine-protein kinase CSK
Name:Tyrosine-protein kinase CSK
Type:Tyrosine-protein kinase
Mol. Mass.:50707.30
Organism:Homo sapiens (Human)
Description:P41240
Residue:450
BDBM110199
NameBDBM110199
Synonyms:5-(2-Hydroxybenzoyl)-1-isopropylpyridin-2(1H)-one (29)
TypeSmall organic molecule
Emp. Form.C15H15NO3
Mol. Mass.257.2845
SMILESCC(C)n1cc(ccc1=O)C(=O)c1ccccc1O