Reaction Details
TargetTyrosine-protein kinase CSK
LigandBDBM110208
Substrate/Competitorn/a
Meas. Tech.c-Src Kinase Inhibitory Activity Assay
pH7.5±n/a
Temperature298.15±n/a K
IC50 1.99e+4±n/a nM
Commentsextracted
Citation Chand, KPrasad, STiwari, RKShirazi, ANKumar, SParang, KSharma, SK Synthesis and evaluation of c-Src kinase inhibitory activity of pyridin-2(1H)-one derivatives. Bioorg Chem53:75-82 (2014) 
 
Tyrosine-protein kinase CSK
Name:Tyrosine-protein kinase CSK
Type:Tyrosine-protein kinase
Mol. Mass.:50707.30
Organism:Homo sapiens (Human)
Description:P41240
Residue:450
BDBM110208
NameBDBM110208
Synonyms:5-(2-Hydroxy-4-methoxybenzoyl)-1-(2-hydroxyethyl)pyridin- 2(1H)-one (38)
TypeSmall organic molecule
Emp. Form.C15H15NO5
Mol. Mass.289.2833
SMILESCOc1ccc(C(=O)c2ccc(=O)n(CCO)c2)c(O)c1