Reaction Details
TargetHeat shock protein HSP 90-alpha
LigandBDBM110227
Substrate/Competitorn/a
Meas. Tech.Fluorescence Polarization Assay
pH7.3±0
IC50 6±0 nM
Citation Lawson, JDCo, EWStafford, JA HSP90 inhibitors US Patent US8618290 Publication Date 12/31/2013
 
Heat shock protein HSP 90-alpha
Name:Heat shock protein HSP 90-alpha
Type:Molecular Chaperone
Mol. Mass.:84623.45
Organism:Homo sapiens (Human)
Description:P07900
Residue:732
BDBM110227
NameBDBM110227
Synonyms:US8618290, 79
TypeSmall organic molecule
Emp. Form.C24H27FN6O3
Mol. Mass.466.508
SMILESCOc1cccc(n1)-c1cc(F)ccc1[C@H]1Cc2nc(N)nc(C)c2C(NOCCCCO)=N1