Reaction Details
TargetHeat shock protein HSP 90-alpha
LigandBDBM110229
Substrate/Competitorn/a
Meas. Tech.Fluorescence Polarization Assay
pH7.3±0
IC50 4±0 nM
Citation Lawson, JDCo, EWStafford, JA HSP90 inhibitors US Patent US8618290 Publication Date 12/31/2013
 
Heat shock protein HSP 90-alpha
Name:Heat shock protein HSP 90-alpha
Type:Molecular Chaperone
Mol. Mass.:84623.45
Organism:Homo sapiens (Human)
Description:P07900
Residue:732
BDBM110229
NameBDBM110229
Synonyms:US8618290, 85
TypeSmall organic molecule
Emp. Form.C26H27F2N7O3
Mol. Mass.523.5345
SMILESCOc1cccc(n1)-c1cc(F)ccc1[C@H]1Cc2nc(N)nc(C)c2C(NOCC(=O)N2CC[C@@H](F)C2)=N1