Reaction Details
TargetProlyl hydroxylase EGLN2
LigandBDBM118330
Substrate/Competitorn/a
Meas. Tech.Inhibition Assay
IC50 750±n/a nM
Citation Thede, KFlamme, IOehme, FErgüden, JStoll, FSchuhmacher, JWild, HKolkhof, PBeck, HKeldenich, JAkbaba, MJeske, M Substituted dihydropyrazolones for treating cardiovascular and hematological diseases US Patent US8653111 Publication Date 2/18/2014
 
Prolyl hydroxylase EGLN2
Name:Prolyl hydroxylase EGLN2
Type:Protein
Mol. Mass.:43657.01
Organism:Homo sapiens (Human)
Description:Q96KS0
Residue:407
BDBM118330
NameBDBM118330
Synonyms:US8653111, 12
TypeSmall organic molecule
Emp. Form.C13H10F3N5O2
Mol. Mass.325.246
SMILESOCc1ccc(nc1)-n1[nH]cc(-n2cnc(c2)C(F)(F)F)c1=O