Reaction Details
TargetProlyl hydroxylase EGLN2
LigandBDBM118339
Substrate/Competitorn/a
Meas. Tech.Inhibition Assay
IC50 490±n/a nM
Citation Thede, KFlamme, IOehme, FErgüden, JStoll, FSchuhmacher, JWild, HKolkhof, PBeck, HKeldenich, JAkbaba, MJeske, M Substituted dihydropyrazolones for treating cardiovascular and hematological diseases US Patent US8653111 Publication Date 2/18/2014
 
Prolyl hydroxylase EGLN2
Name:Prolyl hydroxylase EGLN2
Type:Protein
Mol. Mass.:43657.01
Organism:Homo sapiens (Human)
Description:Q96KS0
Residue:407
BDBM118339
NameBDBM118339
Synonyms:US8653111, 72
TypeSmall organic molecule
Emp. Form.C13H14N8O2
Mol. Mass.314.3027
SMILESO=c1c(c[nH]n1-c1cc(ncn1)N1CCOCC1)-n1ccnn1