Reaction Details
TargetCell division cycle 7-related protein kinase
LigandBDBM123144
Substrate/Competitorn/a
Meas. Tech.MSA assay
pH7.5±n/a
IC50 3±n/a nM
Commentsextracted
Citation Irie, TSawa, ASawa, MAsami, TFunakoshi, YTanaka, C Furanone derivative US Patent US8742113 Publication Date 6/3/2014
 
Cell division cycle 7-related protein kinase
Name:Cell division cycle 7-related protein kinase
Type:Protein
Mol. Mass.:63908.16
Organism:Homo sapiens (Human)
Description:O00311
Residue:574
BDBM123144
NameBDBM123144
Synonyms:US8742113, 173
TypeSmall organic molecule
Emp. Form.C22H18ClN3O5
Mol. Mass.439.848
SMILESCOCCOC(=O)C1C(=O)C(OC1=Nc1ccccc1Cl)=Cc1c[nH]c2ncccc12