Reaction Details
TargetGenome polyprotein
LigandBDBM123412
Substrate/Competitorn/a
Meas. Tech.Enzymatic Assay
Ki 0.3±n/a nM
Citation Simmen, KADe Kock, HARaboisson, PJHu, LTahri, ASurleraux, DLNilsson, KMSamuelsson, BBRosenquist, AAIvanov, VPelcman, MBelfrage, AKJohansson, PMVendeville, SM Macrocyclic inhibitors of hepatitis C virus US Patent US8754106 Publication Date 6/17/2014
 
Genome polyprotein
Name:Genome polyprotein
Synonyms:NS3/4A protein
Type:Enzyme
Mol. Mass.:73007.91
Organism:Hepatitis C virus
Description:B0B3F0
Residue:685
BDBM123412
NameBDBM123412
TypeSmall organic molecule
Emp. Form.C38H46ClN5O7S2
Mol. Mass.784.384
SMILESCOc1ccc2c(O[C@@H]3C[C@@H]4[C@@H](C3)C(=O)N(C)CCCC\C=C/[C@@H]3C[C@]3(NC4=O)C(=O)NS(=O)(=O)C3(C)CC3)cc(nc2c1Cl)-c1nc(cs1)C(C)C