Reaction Details
TargetTyrosine-protein phosphatase non-receptor type 1
LigandBDBM124263
Substrate/Competitorn/a
Meas. Tech.PTP inhibition assay
pH7.2±n/a
IC50 6.9e+2± 3e+3 nM
Commentsextracted
Citation Han, HLu, LWang, QZhu, MYuan, CXing, SFu, X Synthesis and evaluation of oxovanadium(IV) complexes of Schiff-base condensates from 5-substituted-2-hydroxybenzaldehyde and 2-substituted-benzenamine as selective inhibitors of protein tyrosine phosphatase 1B. Dalton Trans41:11116-24 (2012) 
 
Tyrosine-protein phosphatase non-receptor type 1
Name:Tyrosine-protein phosphatase non-receptor type 1
Type:Protein phosphatase
Mol. Mass.:49963.76
Organism:Homo sapiens (Human)
Description:Human recombinant GST-fusion PTP1B (1-435).
Residue:435
BDBM124263
NameBDBM124263
Synonyms:Bis(4-bromo-2-((phenylimino)methyl)phenolate)-oxovanadium(IV) (4)
TypeSmall organic molecule
Emp. Form.C26H18Br2N2O3V
Mol. Mass.617.182
SMILESBrc1ccc2O[V]3(=O)(Oc4ccc(Br)cc4C=[N]3c3ccccc3)[N](=Cc2c1)c1ccccc1