Reaction Details
TargetTyrosine-protein phosphatase non-receptor type 2
LigandBDBM124260
Substrate/Competitorn/a
Meas. Tech.PTP inhibition assay
pH7.2±n/a
IC50 1.9e+2± 3e+3 nM
Commentsextracted
Citation Han, HLu, LWang, QZhu, MYuan, CXing, SFu, X Synthesis and evaluation of oxovanadium(IV) complexes of Schiff-base condensates from 5-substituted-2-hydroxybenzaldehyde and 2-substituted-benzenamine as selective inhibitors of protein tyrosine phosphatase 1B. Dalton Trans41:11116-24 (2012) 
 
Tyrosine-protein phosphatase non-receptor type 2
Name:Tyrosine-protein phosphatase non-receptor type 2
Type:Protein
Mol. Mass.:48481.80
Organism:Homo sapiens (Human)
Description:P17706
Residue:415
BDBM124260
NameBDBM124260
Synonyms:2-((5-Bromo-2-oxybenzylidene)amino)benzoato-diaqua-oxovanadium(IV) (1)
TypeSmall organic molecule
Emp. Form.C14H12BrNO6V
Mol. Mass.421.093
SMILES[OH2+][V]12([OH2+])(=O)OC(=O)c3ccccc3[N]1=Cc1cc(Br)ccc1O2