Reaction Details
TargetTyrosine-protein phosphatase non-receptor type 2
LigandBDBM124261
Substrate/Competitorn/a
Meas. Tech.PTP inhibition assay
pH7.2±n/a
IC50 1.3e+3± 1e+3 nM
Commentsextracted
Citation Han, HLu, LWang, QZhu, MYuan, CXing, SFu, X Synthesis and evaluation of oxovanadium(IV) complexes of Schiff-base condensates from 5-substituted-2-hydroxybenzaldehyde and 2-substituted-benzenamine as selective inhibitors of protein tyrosine phosphatase 1B. Dalton Trans41:11116-24 (2012) 
 
Tyrosine-protein phosphatase non-receptor type 2
Name:Tyrosine-protein phosphatase non-receptor type 2
Type:Protein
Mol. Mass.:48481.80
Organism:Homo sapiens (Human)
Description:P17706
Residue:415
BDBM124261
NameBDBM124261
Synonyms:2-((5-Bromo-2-oxybenzylidene)amino)benzoato-diaqua-oxovanadium(IV) (2)
TypeSmall organic molecule
Emp. Form.C14H12N2O8V
Mol. Mass.387.1941
SMILES[OH2+][V]12([OH2+])(=O)OC(=O)c3ccccc3[N]1=Cc1cc(ccc1O2)[N+]([O-])=O