Reaction Details
TargetTyrosine-protein phosphatase non-receptor type 2
LigandBDBM124262
Substrate/Competitorn/a
Meas. Tech.PTP inhibition assay
pH7.2±n/a
IC50 8.3e+3± 7e+3 nM
Commentsextracted
Citation Han, HLu, LWang, QZhu, MYuan, CXing, SFu, X Synthesis and evaluation of oxovanadium(IV) complexes of Schiff-base condensates from 5-substituted-2-hydroxybenzaldehyde and 2-substituted-benzenamine as selective inhibitors of protein tyrosine phosphatase 1B. Dalton Trans41:11116-24 (2012) 
 
Tyrosine-protein phosphatase non-receptor type 2
Name:Tyrosine-protein phosphatase non-receptor type 2
Type:Protein
Mol. Mass.:48481.80
Organism:Homo sapiens (Human)
Description:P17706
Residue:415
BDBM124262
NameBDBM124262
Synonyms:Bis(4-chloro-2-((phenylimino)methyl)phenolate)-oxovanadium(IV) (3)
TypeSmall organic molecule
Emp. Form.C26H18Cl2N2O3V
Mol. Mass.528.28
SMILESClc1ccc2O[V]3(=O)(Oc4ccc(Cl)cc4C=[N]3c3ccccc3)[N](=Cc2c1)c1ccccc1