Reaction Details
TargetTyrosine-protein phosphatase non-receptor type 11
LigandBDBM124260
Substrate/Competitorn/a
Meas. Tech.PTP inhibition assay
pH7.2±n/a
IC50 4.9e+4± 9e+3 nM
Commentsextracted
Citation Han, HLu, LWang, QZhu, MYuan, CXing, SFu, X Synthesis and evaluation of oxovanadium(IV) complexes of Schiff-base condensates from 5-substituted-2-hydroxybenzaldehyde and 2-substituted-benzenamine as selective inhibitors of protein tyrosine phosphatase 1B. Dalton Trans41:11116-24 (2012) 
 
Tyrosine-protein phosphatase non-receptor type 11
Name:Tyrosine-protein phosphatase non-receptor type 11
Type:Protein phosphatase
Mol. Mass.:68443.59
Organism:Homo sapiens (Human)
Description:Q06124
Residue:593
BDBM124260
NameBDBM124260
Synonyms:2-((5-Bromo-2-oxybenzylidene)amino)benzoato-diaqua-oxovanadium(IV) (1)
TypeSmall organic molecule
Emp. Form.C14H12BrNO6V
Mol. Mass.421.093
SMILES[OH2+][V]12([OH2+])(=O)OC(=O)c3ccccc3[N]1=Cc1cc(Br)ccc1O2