Reaction Details
TargetTyrosine-protein phosphatase non-receptor type 11
LigandBDBM124264
Substrate/Competitorn/a
Meas. Tech.PTP inhibition assay
pH7.2±n/a
IC50 2.6e+3± 2e+3 nM
Commentsextracted
Citation Han, HLu, LWang, QZhu, MYuan, CXing, SFu, X Synthesis and evaluation of oxovanadium(IV) complexes of Schiff-base condensates from 5-substituted-2-hydroxybenzaldehyde and 2-substituted-benzenamine as selective inhibitors of protein tyrosine phosphatase 1B. Dalton Trans41:11116-24 (2012) 
 
Tyrosine-protein phosphatase non-receptor type 11
Name:Tyrosine-protein phosphatase non-receptor type 11
Type:Protein phosphatase
Mol. Mass.:68443.59
Organism:Homo sapiens (Human)
Description:Q06124
Residue:593
BDBM124264
NameBDBM124264
Synonyms:Bis(4-nitro-2-((phenylimino)methyl)phenolate)-oxovanadium(IV) (5)
TypeSmall organic molecule
Emp. Form.C26H18N4O7V
Mol. Mass.549.3852
SMILES[O-][N+](=O)c1ccc2O[V]3(=O)(Oc4ccc(cc4C=[N]3c3ccccc3)[N+]([O-])=O)[N](=Cc2c1)c1ccccc1