Reaction Details
TargetCholesteryl ester transfer protein
LigandBDBM124882
Substrate/Competitorn/a
Meas. Tech.In Vitro Assay
pH7.4±n/a
Temperature310.15±n/a K
IC50 23±n/a nM
Citation Mogi, MKawanami, TYamada, KYasoshima, KImase, HMiyake, TOhmori, O Organic compounds US Patent US8759365 Publication Date 6/24/2014
 
Cholesteryl ester transfer protein
Name:Cholesteryl ester transfer protein
Type:Enzyme
Mol. Mass.:54751.53
Organism:Homo sapiens (Human)
Description:P11597
Residue:493
BDBM124882
NameBDBM124882
Synonyms:US8759365, 6
TypeSmall organic molecule
Emp. Form.C27H30F6N6O2
Mol. Mass.584.5565
SMILESCC[C@@H]1C[C@@H](CN1C(=O)OC(C)C)N(Cc1cc(cc(c1)C(F)(F)F)C(F)(F)F)c1ncc(cn1)-c1cnn(C)c1