Reaction Details
TargetCholesteryl ester transfer protein
LigandBDBM124864
Substrate/Competitorn/a
Meas. Tech.In Vitro Assay
pH7.4±n/a
Temperature310.15±n/a K
IC50 69±n/a nM
Citation Mogi, MKawanami, TYamada, KYasoshima, KImase, HMiyake, TOhmori, O Organic compounds US Patent US8759365 Publication Date 6/24/2014
 
Cholesteryl ester transfer protein
Name:Cholesteryl ester transfer protein
Type:Enzyme
Mol. Mass.:54751.53
Organism:Homo sapiens (Human)
Description:P11597
Residue:493
BDBM124864
NameBDBM124864
Synonyms:US8759365, 6-1
TypeSmall organic molecule
Emp. Form.C28H32F6N6O2
Mol. Mass.598.5831
SMILESCC[C@@H]1C[C@@H](CN1C(=O)OCC(C)C)N(Cc1cc(cc(c1)C(F)(F)F)C(F)(F)F)c1ncc(cn1)-c1cnn(C)c1