Reaction Details
TargetHigh affinity nerve growth factor receptor
LigandBDBM127628
Substrate/Competitorn/a
Meas. Tech.ELISA Assay
pH7.5±n/a
IC50 0.7±n/a nM
Commentsextracted
Citation Allen, SAndrews, SWCondroski, KRHaas, JHuang, LJiang, YKercher, TSeo, J Substituted pyrazolo[1,5-a]pyrimidine compounds as Trk kinase inhibitors US Patent US8791123 Publication Date 7/29/2014
 
High affinity nerve growth factor receptor
Name:High affinity nerve growth factor receptor
Type:n/a
Mol. Mass.:87498.18
Organism:Homo sapiens (Human)
Description:P04629
Residue:796
BDBM127628
NameBDBM127628
Synonyms:US10251889, Example 1 US8791123, 1 US9796724, Example 1
TypeSmall organic molecule
Emp. Form.C21H23F2N5O
Mol. Mass.399.437
SMILESCC(C)(C)NC(=O)c1cnn2ccc(nc12)N1CCC[C@@H]1c1cc(F)ccc1F