Reaction Details
TargetHigh affinity nerve growth factor receptor
LigandBDBM127629
Substrate/Competitorn/a
Meas. Tech.ELISA Assay
pH7.5±n/a
IC50 0.7±n/a nM
Commentsextracted
Citation Allen, SAndrews, SWCondroski, KRHaas, JHuang, LJiang, YKercher, TSeo, J Substituted pyrazolo[1,5-a]pyrimidine compounds as Trk kinase inhibitors US Patent US8791123 Publication Date 7/29/2014
 
High affinity nerve growth factor receptor
Name:High affinity nerve growth factor receptor
Type:n/a
Mol. Mass.:87498.18
Organism:Homo sapiens (Human)
Description:P04629
Residue:796
BDBM127629
NameBDBM127629
Synonyms:US10251889, Example 2 US8791123, 2 US9796724, Example 2
TypeSmall organic molecule
Emp. Form.C22H18F2N6O
Mol. Mass.420.4147
SMILESFc1ccc(F)c(c1)[C@H]1CCCN1c1ccn2ncc(C(=O)Nc3ccccn3)c2n1