Reaction Details
TargetHigh affinity nerve growth factor receptor
LigandBDBM127632
Substrate/Competitorn/a
Meas. Tech.ELISA Assay
pH7.5±n/a
IC50 0.95±n/a nM
Commentsextracted
Citation Allen, SAndrews, SWCondroski, KRHaas, JHuang, LJiang, YKercher, TSeo, J Substituted pyrazolo[1,5-a]pyrimidine compounds as Trk kinase inhibitors US Patent US8791123 Publication Date 7/29/2014
 
High affinity nerve growth factor receptor
Name:High affinity nerve growth factor receptor
Type:n/a
Mol. Mass.:87498.18
Organism:Homo sapiens (Human)
Description:P04629
Residue:796
BDBM127632
NameBDBM127632
Synonyms:US10251889, Example 5 US8791123, 5 US9796724, Example 5
TypeSmall organic molecule
Emp. Form.C23H21F2N5O2
Mol. Mass.437.4419
SMILESCc1ccc(CNC(=O)c2cnn3ccc(nc23)N2CCC[C@@H]2c2cc(F)ccc2F)o1