Reaction Details
TargetHigh affinity nerve growth factor receptor
LigandBDBM127633
Substrate/Competitorn/a
Meas. Tech.ELISA Assay
pH7.5±n/a
IC50 1.55±n/a nM
Commentsextracted
Citation Allen, SAndrews, SWCondroski, KRHaas, JHuang, LJiang, YKercher, TSeo, J Substituted pyrazolo[1,5-a]pyrimidine compounds as Trk kinase inhibitors US Patent US8791123 Publication Date 7/29/2014
 
High affinity nerve growth factor receptor
Name:High affinity nerve growth factor receptor
Type:n/a
Mol. Mass.:87498.18
Organism:Homo sapiens (Human)
Description:P04629
Residue:796
BDBM127633
NameBDBM127633
Synonyms:US10251889, Example 6 US8791123, 6 US9796724, Example 6
TypeSmall organic molecule
Emp. Form.C21H19F2N7O
Mol. Mass.423.4187
SMILESCn1ccc(NC(=O)c2cnn3ccc(nc23)N2CCC[C@@H]2c2cc(F)ccc2F)n1