Reaction Details
TargetHigh affinity nerve growth factor receptor
LigandBDBM127647
Substrate/Competitorn/a
Meas. Tech.ELISA Assay
pH7.5±n/a
IC50 0.6±n/a nM
Commentsextracted
Citation Allen, SAndrews, SWCondroski, KRHaas, JHuang, LJiang, YKercher, TSeo, J Substituted pyrazolo[1,5-a]pyrimidine compounds as Trk kinase inhibitors US Patent US8791123 Publication Date 7/29/2014
 
High affinity nerve growth factor receptor
Name:High affinity nerve growth factor receptor
Type:n/a
Mol. Mass.:87498.18
Organism:Homo sapiens (Human)
Description:P04629
Residue:796
BDBM127647
NameBDBM127647
Synonyms:US10251889, Example 20 US8791123, 20 US9796724, Example 20
TypeSmall organic molecule
Emp. Form.C22H23F2N5O2
Mol. Mass.427.4471
SMILESFc1ccc(F)c(c1)[C@H]1CCCN1c1ccn2ncc(C(=O)NC3CCOCC3)c2n1