Reaction Details
TargetHigh affinity nerve growth factor receptor
LigandBDBM127652
Substrate/Competitorn/a
Meas. Tech.ELISA Assay
pH7.5±n/a
IC50 0.4±n/a nM
Commentsextracted
Citation Allen, SAndrews, SWCondroski, KRHaas, JHuang, LJiang, YKercher, TSeo, J Substituted pyrazolo[1,5-a]pyrimidine compounds as Trk kinase inhibitors US Patent US8791123 Publication Date 7/29/2014
 
High affinity nerve growth factor receptor
Name:High affinity nerve growth factor receptor
Type:n/a
Mol. Mass.:87498.18
Organism:Homo sapiens (Human)
Description:P04629
Residue:796
BDBM127652
NameBDBM127652
Synonyms:US8791123, 25
TypeSmall organic molecule
Emp. Form.C22H21F2N7O
Mol. Mass.437.4452
SMILESFc1ccc(F)c(c1)[C@H]1CCCN1c1ccn2ncc(C(=O)NCCc3cnc[nH]3)c2n1