Reaction Details
TargetHigh affinity nerve growth factor receptor
LigandBDBM127660
Substrate/Competitorn/a
Meas. Tech.ELISA Assay
pH7.5±n/a
IC50 1.5±n/a nM
Commentsextracted
Citation Allen, SAndrews, SWCondroski, KRHaas, JHuang, LJiang, YKercher, TSeo, J Substituted pyrazolo[1,5-a]pyrimidine compounds as Trk kinase inhibitors US Patent US8791123 Publication Date 7/29/2014
 
High affinity nerve growth factor receptor
Name:High affinity nerve growth factor receptor
Type:n/a
Mol. Mass.:87498.18
Organism:Homo sapiens (Human)
Description:P04629
Residue:796
BDBM127660
NameBDBM127660
Synonyms:US8791123, 33
TypeSmall organic molecule
Emp. Form.C24H25F2N5O3
Mol. Mass.469.4838
SMILESOC(=O)C1CCC(CC1)NC(=O)c1cnn2ccc(nc12)N1CCCC1c1cc(F)ccc1F