Reaction Details
TargetHigh affinity nerve growth factor receptor
LigandBDBM127664
Substrate/Competitorn/a
Meas. Tech.ELISA Assay
pH7.5±n/a
IC50 1.65±n/a nM
Commentsextracted
Citation Allen, SAndrews, SWCondroski, KRHaas, JHuang, LJiang, YKercher, TSeo, J Substituted pyrazolo[1,5-a]pyrimidine compounds as Trk kinase inhibitors US Patent US8791123 Publication Date 7/29/2014
 
High affinity nerve growth factor receptor
Name:High affinity nerve growth factor receptor
Type:n/a
Mol. Mass.:87498.18
Organism:Homo sapiens (Human)
Description:P04629
Residue:796
BDBM127664
NameBDBM127664
Synonyms:US10251889, Example 37 US8791123, 37 US9796724, Example 37
TypeSmall organic molecule
Emp. Form.C20H20FN5O
Mol. Mass.365.4041
SMILESFc1cccc(c1)[C@H]1CCCN1c1ccn2ncc(C(=O)NC3CC3)c2n1