Reaction Details
TargetHigh affinity nerve growth factor receptor
LigandBDBM127665
Substrate/Competitorn/a
Meas. Tech.ELISA Assay
pH7.5±n/a
IC50 1.3±n/a nM
Commentsextracted
Citation Allen, SAndrews, SWCondroski, KRHaas, JHuang, LJiang, YKercher, TSeo, J Substituted pyrazolo[1,5-a]pyrimidine compounds as Trk kinase inhibitors US Patent US8791123 Publication Date 7/29/2014
 
High affinity nerve growth factor receptor
Name:High affinity nerve growth factor receptor
Type:n/a
Mol. Mass.:87498.18
Organism:Homo sapiens (Human)
Description:P04629
Residue:796
BDBM127665
NameBDBM127665
Synonyms:US8791123, 38
TypeSmall organic molecule
Emp. Form.C21H20F2N6O
Mol. Mass.410.4199
SMILESCC(C)(NC(=O)c1cnn2ccc(nc12)N1CCCC1c1cc(F)ccc1F)C#N