Reaction Details
TargetHigh affinity nerve growth factor receptor
LigandBDBM127671
Substrate/Competitorn/a
Meas. Tech.ELISA Assay
pH7.5±n/a
IC50 1.5±n/a nM
Commentsextracted
Citation Allen, SAndrews, SWCondroski, KRHaas, JHuang, LJiang, YKercher, TSeo, J Substituted pyrazolo[1,5-a]pyrimidine compounds as Trk kinase inhibitors US Patent US8791123 Publication Date 7/29/2014
 
High affinity nerve growth factor receptor
Name:High affinity nerve growth factor receptor
Type:n/a
Mol. Mass.:87498.18
Organism:Homo sapiens (Human)
Description:P04629
Residue:796
BDBM127671
NameBDBM127671
Synonyms:US8791123, 44
TypeSmall organic molecule
Emp. Form.C23H26F2N6O3S
Mol. Mass.504.553
SMILESCS(=O)(=O)N1CCC(CC1)NC(=O)c1cnn2ccc(nc12)N1CCCC1c1cc(F)ccc1F